Target
Alkaline phosphatase, germ cell type
Ligand
BDBM76200
Substrate
Meas. Tech.
Dose Response confirmation of uHTS inhibitors of Mouse Intestinal Alkaline Phosphatase using Placental Alkaline Phosphatase
IC50
>100000±n/a nM
Citation
 PubChem, PC Dose Response confirmation of uHTS inhibitors of Mouse Intestinal Alkaline Phosphatase using Placental Alkaline Phosphatase PubChem Bioassay (2010)[AID] 
Target
Name:
Alkaline phosphatase, germ cell type
Synonyms:
ALPG ALPPL2 PPBN_HUMAN | placental-like alkaline phosphatase preproprotein
Type:
PROTEIN
Mol. Mass.:
57374.31
Organism:
Homo sapiens (Human)
Description:
ChEMBL_29964
Residue:
532
  
Inhibitor
Name:
BDBM76200
Synonyms:
4-tert-Butyl-2-[(6-nitro-benzo[1,3]dioxol-5-ylmethylene)-amino]-phenol 4-tert-butyl-2-[(6-nitro-1,3-benzodioxol-5-yl)methylideneamino]phenol SMR000513430 | cid_825693
Type:
Small organic molecule
Emp. Form.:
C18H18N2O5
Mol. Mass.:
342.3459
SMILES:
CC(C)(C)c1ccc(O)c(c1)\N=C\c1cc2OCOc2cc1[N+]([O-])=O
: