Target
Alkaline phosphatase, germ cell type
Ligand
BDBM50241354
Substrate
Meas. Tech.
Dose Response confirmation of uHTS inhibitors of Mouse Intestinal Alkaline Phosphatase using Placental Alkaline Phosphatase
IC50
>100000±n/a nM
Citation
 PubChem, PC Dose Response confirmation of uHTS inhibitors of Mouse Intestinal Alkaline Phosphatase using Placental Alkaline Phosphatase PubChem Bioassay (2010)[AID] 
Target
Name:
Alkaline phosphatase, germ cell type
Synonyms:
ALPG ALPPL2 PPBN_HUMAN | placental-like alkaline phosphatase preproprotein
Type:
PROTEIN
Mol. Mass.:
57374.31
Organism:
Homo sapiens (Human)
Description:
ChEMBL_29964
Residue:
532
  
Inhibitor
Name:
BDBM50241354
Synonyms:
2-(3,4-Dihydroxy-phenyl)-5,7-dihydroxy-3-(3,4,5-trihydroxy-6-hydroxymethyl-tetrahydro-pyran-2-yloxy)-chromen-4-one 2-(3,4-dihydroxyphenyl)-5,7-dihydroxy-3-((2S,3R,4S,5S,6R)-3,4,5-trihydroxy-6-(hydroxymethyl)-tetrahydro-2H-pyran-2-yloxy)-4H-chromen-4-one 3,3',4',5,7-pentahydroxyflavone-3-beta-O-glucoside CHEMBL250450 Hyperoside Quercetin 3-O-beta-D-glucoside Quercetin-3-glucoside cid_5378597 hydroside isoquercetrin quercetin 3-O-beta-D-galactopyranoside quercetin 3-O-galactoside quercetin 3-O-glucoside | quercetin-3-galactoside
Type:
Small organic molecule
Emp. Form.:
C21H20O12
Mol. Mass.:
464.3763
SMILES:
OC[C@H]1O[C@@H](Oc2c(O)c3c(cc(O)cc3=O)oc2-c2ccc(O)c(O)c2)[C@H](O)[C@@H](O)[C@@H]1O
: