Target
Alkaline phosphatase, germ cell type
Ligand
BDBM76221
Substrate
Meas. Tech.
Dose Response confirmation of uHTS inhibitors of Mouse Intestinal Alkaline Phosphatase using Placental Alkaline Phosphatase
IC50
>100000±n/a nM
Citation
 PubChem, PC Dose Response confirmation of uHTS inhibitors of Mouse Intestinal Alkaline Phosphatase using Placental Alkaline Phosphatase PubChem Bioassay (2010)[AID] 
Target
Name:
Alkaline phosphatase, germ cell type
Synonyms:
ALPG ALPPL2 PPBN_HUMAN | placental-like alkaline phosphatase preproprotein
Type:
PROTEIN
Mol. Mass.:
57374.31
Organism:
Homo sapiens (Human)
Description:
ChEMBL_29964
Residue:
532
  
Inhibitor
Name:
BDBM76221
Synonyms:
MLS001096126 N-[(2-ethoxyphenyl)methyl]-3-[(2-oxidanylidene-3H-1,3-benzoxazol-6-yl)sulfonylamino]propanamide SMR000631062 | cid_24793730
Type:
Small organic molecule
Emp. Form.:
C19H21N3O6S
Mol. Mass.:
419.452
SMILES:
CCOc1ccccc1CNC(=O)CCNS(=O)(=O)c1ccc2[nH]c(=O)oc2c1
: