Target
Alkaline phosphatase, tissue-nonspecific isozyme
Ligand
BDBM76153
Substrate
Meas. Tech.
Dose Response confirmation of uHTS activators of Mouse Intestinal Alkaline Phosphatase using Tissue Nonspecific Alkaline Phosphatase.
EC50
48900±n/a nM
Citation
 PubChem, PC Dose Response confirmation of uHTS activators of Mouse Intestinal Alkaline Phosphatase using Tissue Nonspecific Alkaline Phosphatase. PubChem Bioassay (2010)[AID] 
Target
Name:
Alkaline phosphatase, tissue-nonspecific isozyme
Synonyms:
ALPL tissue-nonspecific alkaline phosphatase precursor
Type:
PROTEIN
Mol. Mass.:
57306.17
Organism:
Homo sapiens (Human)
Description:
ChEMBL_1448917
Residue:
524
  
Inhibitor
Name:
BDBM76153
Synonyms:
3-[2-(3,4-Dimethoxy-phenyl)-ethyl]-2-[(Z)-4-methoxy-phenylimino]-4-oxo-[1,3]thiazinane-6-carboxylic acid amide 3-[2-(3,4-dimethoxyphenyl)ethyl]-2-(4-methoxyphenyl)imino-4-oxo-1,3-thiazinane-6-carboxamide MLS000527868 cid_3141791
Type:
Small organic molecule
Emp. Form.:
C22H25N3O5S
Mol. Mass.:
443.516
SMILES:
COc1ccc(cc1)\N=C1/SC(CC(=O)N1CCc1ccc(OC)c(OC)c1)C(N)=O
: