Target
Alkaline phosphatase, tissue-nonspecific isozyme
Ligand
BDBM76162
Substrate
Meas. Tech.
Dose Response confirmation of uHTS activators of Mouse Intestinal Alkaline Phosphatase using Tissue Nonspecific Alkaline Phosphatase.
EC50
85800±n/a nM
Citation
 PubChem, PC Dose Response confirmation of uHTS activators of Mouse Intestinal Alkaline Phosphatase using Tissue Nonspecific Alkaline Phosphatase. PubChem Bioassay (2010)[AID] 
Target
Name:
Alkaline phosphatase, tissue-nonspecific isozyme
Synonyms:
ALPL tissue-nonspecific alkaline phosphatase precursor
Type:
PROTEIN
Mol. Mass.:
57306.17
Organism:
Homo sapiens (Human)
Description:
ChEMBL_1448917
Residue:
524
  
Inhibitor
Name:
BDBM76162
Synonyms:
5-bromo-2-furancarboxylic acid [2-[(5-nitro-2-thiazolyl)amino]-2-oxoethyl] ester MLS002159188 [2-[(5-nitro-1,3-thiazol-2-yl)amino]-2-oxidanylidene-ethyl] 5-bromanylfuran-2-carboxylate cid_4274506
Type:
Small organic molecule
Emp. Form.:
C10H6BrN3O6S
Mol. Mass.:
376.14
SMILES:
[O-][N+](=O)c1cnc(NC(=O)COC(=O)c2ccc(Br)o2)s1
: