Target
Alkaline phosphatase, tissue-nonspecific isozyme
Ligand
BDBM41894
Substrate
Meas. Tech.
Dose Response confirmation of uHTS activators of Mouse Intestinal Alkaline Phosphatase using Tissue Nonspecific Alkaline Phosphatase.
EC50
68000±n/a nM
Citation
 PubChem, PC Dose Response confirmation of uHTS activators of Mouse Intestinal Alkaline Phosphatase using Tissue Nonspecific Alkaline Phosphatase. PubChem Bioassay (2010)[AID] 
Target
Name:
Alkaline phosphatase, tissue-nonspecific isozyme
Synonyms:
ALPL tissue-nonspecific alkaline phosphatase precursor
Type:
PROTEIN
Mol. Mass.:
57306.17
Organism:
Homo sapiens (Human)
Description:
ChEMBL_1448917
Residue:
524
  
Inhibitor
Name:
BDBM41894
Synonyms:
1-(3,4-dihydroxyphenyl)-2-[[5-(3-methoxyphenyl)-4-prop-2-enyl-1,2,4-triazol-3-yl]sulfanyl]ethanone 1-[3,4-bis(oxidanyl)phenyl]-2-[[5-(3-methoxyphenyl)-4-prop-2-enyl-1,2,4-triazol-3-yl]sulfanyl]ethanone MLS-0390843.0001 | cid_1409759
Type:
Small organic molecule
Emp. Form.:
C20H19N3O4S
Mol. Mass.:
397.448
SMILES:
COc1cccc(c1)-c1nnc(SCC(=O)c2ccc(O)c(O)c2)n1CC=C
: