Target
Alkaline phosphatase, tissue-nonspecific isozyme
Ligand
BDBM39724
Substrate
Meas. Tech.
Dose Response confirmation of uHTS inhibitors of Human Intestinal Alkaline Phosphatase using Tissue Nonspecific Alkaline Phosphatase.
IC50
47900±n/a nM
Citation
 PubChem, PC Dose Response confirmation of uHTS inhibitors of Human Intestinal Alkaline Phosphatase using Tissue Nonspecific Alkaline Phosphatase. PubChem Bioassay (2010)[AID] 
Target
Name:
Alkaline phosphatase, tissue-nonspecific isozyme
Synonyms:
ALPL tissue-nonspecific alkaline phosphatase precursor
Type:
PROTEIN
Mol. Mass.:
57306.17
Organism:
Homo sapiens (Human)
Description:
ChEMBL_1448917
Residue:
524
  
Inhibitor
Name:
BDBM39724
Synonyms:
4-(2-benzylsulfanylethyl)pyridine;phosphoric acid 4-[2-(benzylthio)ethyl]pyridine;phosphoric acid 4-[2-(phenylmethylthio)ethyl]pyridine;phosphoric acid SMR000137553 | cid_2827182
Type:
Small organic molecule
Emp. Form.:
C14H15NS
Mol. Mass.:
229.341
SMILES:
C(Cc1ccncc1)SCc1ccccc1
: