Target
Alkaline phosphatase, tissue-nonspecific isozyme
Ligand
BDBM53353
Substrate
Meas. Tech.
Dose Response confirmation of uHTS inhibitors of Human Intestinal Alkaline Phosphatase using Tissue Nonspecific Alkaline Phosphatase.
IC50
20300±n/a nM
Citation
 PubChem, PC Dose Response confirmation of uHTS inhibitors of Human Intestinal Alkaline Phosphatase using Tissue Nonspecific Alkaline Phosphatase. PubChem Bioassay (2010)[AID] 
Target
Name:
Alkaline phosphatase, tissue-nonspecific isozyme
Synonyms:
ALPL tissue-nonspecific alkaline phosphatase precursor
Type:
PROTEIN
Mol. Mass.:
57306.17
Organism:
Homo sapiens (Human)
Description:
ChEMBL_1448917
Residue:
524
  
Inhibitor
Name:
BDBM53353
Synonyms:
4-[(7-chloranyl-2-methoxy-1,5-dihydrobenzo[b][1,5]naphthyridin-10-yl)imino]-2,6-bis(pyrrolidin-1-ylmethyl)cyclohexa-2,5-dien-1-one;phosphoric acid 4-[(7-chloro-2-methoxy-1,5-dihydrobenzo[b][1,5]naphthyridin-10-yl)imino]-2,6-bis(pyrrolidin-1-ylmethyl)cyclohexa-2,5-dien-1-one;phosphoric acid MLS001306480 cid_20833062
Type:
Small organic molecule
Emp. Form.:
C29H32ClN5O2
Mol. Mass.:
518.05
SMILES:
COc1ccc2nc3cc(Cl)ccc3c(Nc3cc(CN4CCCC4)c(O)c(CN4CCCC4)c3)c2n1
: