Target
DNA (cytosine-5)-methyltransferase 3A
Ligand
BDBM75328
Substrate
Meas. Tech.
SAR Selectivity Analysis of small molecule inhibitors of PEST using pCAP in a fluorescence assay
IC50
>100000±n/a nM
Citation
 PubChem, PC SAR Selectivity Analysis of small molecule inhibitors of PEST using pCAP in a fluorescence assay PubChem Bioassay (2010)[AID] 
Target
Name:
DNA (cytosine-5)-methyltransferase 3A
Synonyms:
DNA (cytosine-5)-methyltransferase 3A DNA methyltransferase HsaIIIA DNMT3A M.HsaIIIA | tyrosine-protein phosphatase non-receptor type 12 isoform 2
Type:
PROTEIN
Mol. Mass.:
101857.24
Organism:
Homo sapiens (Human)
Description:
ChEMBL_1510405
Residue:
912
  
Inhibitor
Name:
BDBM75328
Synonyms:
2-[(5Z)-4-keto-5-p-anisylidene-2-thioxo-thiazolidin-3-yl]succinic acid 2-[(5Z)-5-[(4-methoxyphenyl)methylidene]-4-oxo-2-sulfanylidene-1,3-thiazolidin-3-yl]butanedioic acid MLS-0146316.0001 | cid_5717718
Type:
Small organic molecule
Emp. Form.:
C15H13NO6S2
Mol. Mass.:
367.397
SMILES:
COc1ccc(\C=C2/SC(=S)N(C(CC(O)=O)C(O)=O)C2=O)cc1
: