Target
DNA (cytosine-5)-methyltransferase 3A
Ligand
BDBM46218
Substrate
Meas. Tech.
SAR Selectivity Analysis of small molecule inhibitors of PEST using pCAP in a fluorescence assay
IC50
>100000±n/a nM
Citation
 PubChem, PC SAR Selectivity Analysis of small molecule inhibitors of PEST using pCAP in a fluorescence assay PubChem Bioassay (2010)[AID] 
Target
Name:
DNA (cytosine-5)-methyltransferase 3A
Synonyms:
DNA (cytosine-5)-methyltransferase 3A DNA methyltransferase HsaIIIA DNMT3A M.HsaIIIA | tyrosine-protein phosphatase non-receptor type 12 isoform 2
Type:
PROTEIN
Mol. Mass.:
101857.24
Organism:
Homo sapiens (Human)
Description:
ChEMBL_1510405
Residue:
912
  
Inhibitor
Name:
BDBM46218
Synonyms:
2-(3-methyl-4-methylsulfanyl-phenoxy)ethanoic acid 2-[3-methyl-4-(methylthio)phenoxy]acetic acid cid_823134
Type:
Small organic molecule
Emp. Form.:
C10H12O3S
Mol. Mass.:
212.265
SMILES:
CSc1ccc(OCC(O)=O)cc1C
: