Target
DNA (cytosine-5)-methyltransferase 3A
Ligand
BDBM46276
Substrate
Meas. Tech.
SAR Selectivity Analysis of small molecule inhibitors of PEST using pCAP in a fluorescence assay
IC50
7990±n/a nM
Citation
 PubChem, PC SAR Selectivity Analysis of small molecule inhibitors of PEST using pCAP in a fluorescence assay PubChem Bioassay (2010)[AID] 
Target
Name:
DNA (cytosine-5)-methyltransferase 3A
Synonyms:
DNA (cytosine-5)-methyltransferase 3A DNA methyltransferase HsaIIIA DNMT3A M.HsaIIIA | tyrosine-protein phosphatase non-receptor type 12 isoform 2
Type:
PROTEIN
Mol. Mass.:
101857.24
Organism:
Homo sapiens (Human)
Description:
ChEMBL_1510405
Residue:
912
  
Inhibitor
Name:
BDBM46276
Synonyms:
2-[2,6-bis(chloranyl)-4-[(Z)-[6-ethoxycarbonyl-5-(3-methoxyphenyl)-7-methyl-3-oxidanylidene-5H-[1,3]thiazolo[3,2-a]pyrimidin-2-ylidene]methyl]phenoxy]ethanoic acid 2-[2,6-dichloro-4-[(Z)-[6-ethoxycarbonyl-5-(3-methoxyphenyl)-7-methyl-3-oxo-5H-thiazolo[3,2-a]pyrimidin-2-ylidene]methyl]phenoxy]acetic acid MLS-0425590.0001 | cid_6000533
Type:
Small organic molecule
Emp. Form.:
C26H22Cl2N2O7S
Mol. Mass.:
577.433
SMILES:
CCOC(=O)C1=C(C)N=c2s\c(=C/c3cc(Cl)c(OCC(O)=O)c(Cl)c3)c(=O)n2C1c1cccc(OC)c1
: