Target
DNA (cytosine-5)-methyltransferase 3A
Ligand
BDBM65965
Substrate
Meas. Tech.
SAR Selectivity Analysis of small molecule inhibitors of PEST using pCAP in a fluorescence assay
IC50
>100000±n/a nM
Citation
 PubChem, PC SAR Selectivity Analysis of small molecule inhibitors of PEST using pCAP in a fluorescence assay PubChem Bioassay (2010)[AID] 
Target
Name:
DNA (cytosine-5)-methyltransferase 3A
Synonyms:
DNA (cytosine-5)-methyltransferase 3A DNA methyltransferase HsaIIIA DNMT3A M.HsaIIIA | tyrosine-protein phosphatase non-receptor type 12 isoform 2
Type:
PROTEIN
Mol. Mass.:
101857.24
Organism:
Homo sapiens (Human)
Description:
ChEMBL_1510405
Residue:
912
  
Inhibitor
Name:
BDBM65965
Synonyms:
2-[4-[2-(4-chloranylphenoxy)ethanoylamino]phenoxy]ethanoic acid 2-[4-[[2-(4-chlorophenoxy)acetyl]amino]phenoxy]acetic acid cid_893991
Type:
Small organic molecule
Emp. Form.:
C16H14ClNO5
Mol. Mass.:
335.739
SMILES:
OC(=O)COc1ccc(NC(=O)COc2ccc(Cl)cc2)cc1
: