Target
DNA (cytosine-5)-methyltransferase 3A
Ligand
BDBM65970
Substrate
Meas. Tech.
SAR Selectivity Analysis of small molecule inhibitors of PEST using pCAP in a fluorescence assay
IC50
>100000±n/a nM
Citation
 PubChem, PC SAR Selectivity Analysis of small molecule inhibitors of PEST using pCAP in a fluorescence assay PubChem Bioassay (2010)[AID] 
Target
Name:
DNA (cytosine-5)-methyltransferase 3A
Synonyms:
DNA (cytosine-5)-methyltransferase 3A DNA methyltransferase HsaIIIA DNMT3A M.HsaIIIA | tyrosine-protein phosphatase non-receptor type 12 isoform 2
Type:
PROTEIN
Mol. Mass.:
101857.24
Organism:
Homo sapiens (Human)
Description:
ChEMBL_1510405
Residue:
912
  
Inhibitor
Name:
BDBM65970
Synonyms:
2-[4-[[[3-[(2-methoxyphenyl)sulfamoyl]benzoyl]hydrazinylidene]methyl]phenoxy]acetic acid 2-[4-[[[3-[(2-methoxyphenyl)sulfamoyl]phenyl]carbonylhydrazinylidene]methyl]phenoxy]ethanoic acid MLS-0256798.0001 | cid_2127695
Type:
Small organic molecule
Emp. Form.:
C23H21N3O7S
Mol. Mass.:
483.494
SMILES:
COc1ccccc1NS(=O)(=O)c1cccc(c1)C(=O)NN=Cc1ccc(OCC(O)=O)cc1
: