Target
DNA (cytosine-5)-methyltransferase 3A
Ligand
BDBM61652
Substrate
Meas. Tech.
SAR Selectivity Analysis of small molecule inhibitors of PEST using pCAP in a fluorescence assay
IC50
17200±n/a nM
Citation
 PubChem, PC SAR Selectivity Analysis of small molecule inhibitors of PEST using pCAP in a fluorescence assay PubChem Bioassay (2010)[AID] 
Target
Name:
DNA (cytosine-5)-methyltransferase 3A
Synonyms:
DNA (cytosine-5)-methyltransferase 3A DNA methyltransferase HsaIIIA DNMT3A M.HsaIIIA | tyrosine-protein phosphatase non-receptor type 12 isoform 2
Type:
PROTEIN
Mol. Mass.:
101857.24
Organism:
Homo sapiens (Human)
Description:
ChEMBL_1510405
Residue:
912
  
Inhibitor
Name:
BDBM61652
Synonyms:
2-hydroxy-4-[[1-oxo-4-[(5Z)-4-oxo-5-(phenylmethylene)-2-sulfanylidene-3-thiazolidinyl]butyl]amino]benzoic acid 4-[4-[(5Z)-5-benzal-4-keto-2-thioxo-thiazolidin-3-yl]butanoylamino]-2-hydroxy-benzoic acid MLS001157852 cid_6226024
Type:
Small organic molecule
Emp. Form.:
C21H18N2O5S2
Mol. Mass.:
442.508
SMILES:
OC(=O)c1ccc(NC(=O)CCCN2C(=S)S\C(=C/c3ccccc3)C2=O)cc1O
: