Target
DNA (cytosine-5)-methyltransferase 3A
Ligand
BDBM65973
Substrate
Meas. Tech.
SAR Selectivity Analysis of small molecule inhibitors of PEST using pCAP in a fluorescence assay
IC50
2690±n/a nM
Citation
 PubChem, PC SAR Selectivity Analysis of small molecule inhibitors of PEST using pCAP in a fluorescence assay PubChem Bioassay (2010)[AID] 
Target
Name:
DNA (cytosine-5)-methyltransferase 3A
Synonyms:
DNA (cytosine-5)-methyltransferase 3A DNA methyltransferase HsaIIIA DNMT3A M.HsaIIIA | tyrosine-protein phosphatase non-receptor type 12 isoform 2
Type:
PROTEIN
Mol. Mass.:
101857.24
Organism:
Homo sapiens (Human)
Description:
ChEMBL_1510405
Residue:
912
  
Inhibitor
Name:
BDBM65973
Synonyms:
3-[[(E)-2-cyano-3-[3-methoxy-4-(4-methylbenzyl)oxy-phenyl]acryloyl]amino]benzoic acid 3-[[(E)-2-cyano-3-[3-methoxy-4-[(4-methylphenyl)methoxy]phenyl]prop-2-enoyl]amino]benzoic acid cid_1516213
Type:
Small organic molecule
Emp. Form.:
C26H22N2O5
Mol. Mass.:
442.4633
SMILES:
COc1cc(\C=C(/C#N)C(=O)Nc2cccc(c2)C(O)=O)ccc1OCc1ccc(C)cc1
: