Target
DNA (cytosine-5)-methyltransferase 3A
Ligand
BDBM76338
Substrate
Meas. Tech.
SAR Selectivity Analysis of small molecule inhibitors of PEST using pCAP in a fluorescence assay
IC50
37400±n/a nM
Citation
 PubChem, PC SAR Selectivity Analysis of small molecule inhibitors of PEST using pCAP in a fluorescence assay PubChem Bioassay (2010)[AID] 
Target
Name:
DNA (cytosine-5)-methyltransferase 3A
Synonyms:
DNA (cytosine-5)-methyltransferase 3A DNA methyltransferase HsaIIIA DNMT3A M.HsaIIIA | tyrosine-protein phosphatase non-receptor type 12 isoform 2
Type:
PROTEIN
Mol. Mass.:
101857.24
Organism:
Homo sapiens (Human)
Description:
ChEMBL_1510405
Residue:
912
  
Inhibitor
Name:
BDBM76338
Synonyms:
2-[4-[(E)-[[4-[2-(4-chloroanilino)thiazol-4-yl]benzoyl]hydrazono]methyl]phenoxy]acetic acid ethyl ester MLS-0437130.0001 ethyl 2-[4-[(E)-[[4-[2-(4-chloroanilino)-1,3-thiazol-4-yl]benzoyl]hydrazinylidene]methyl]phenoxy]acetate | ethyl 2-[4-[(E)-[[4-[2-[(4-chlorophenyl)amino]-1,3-thiazol-4-yl]phenyl]carbonylhydrazinylidene]methyl]phenoxy]ethanoate
Type:
Small organic molecule
Emp. Form.:
C27H23ClN4O4S
Mol. Mass.:
535.014
SMILES:
CCOC(=O)COc1ccc(\C=N\NC(=O)c2ccc(cc2)-c2csc(Nc3ccc(Cl)cc3)n2)cc1
: