Target
Alkaline phosphatase, tissue-nonspecific isozyme
Ligand
BDBM49122
Substrate
Meas. Tech.
Dose Response confirmation of uHTS activators of Human Intestinal Alkaline Phosphatase using Tissue Nonspecific Alkaline Phosphatase.
EC50
>100000±n/a nM
Citation
 PubChem, PC Dose Response confirmation of uHTS activators of Human Intestinal Alkaline Phosphatase using Tissue Nonspecific Alkaline Phosphatase. PubChem Bioassay (2010)[AID] 
Target
Name:
Alkaline phosphatase, tissue-nonspecific isozyme
Synonyms:
ALPL tissue-nonspecific alkaline phosphatase precursor
Type:
PROTEIN
Mol. Mass.:
57306.17
Organism:
Homo sapiens (Human)
Description:
ChEMBL_1448917
Residue:
524
  
Inhibitor
Name:
BDBM49122
Synonyms:
2-amino-3-hydroxy-N'-(2,3,4-trihydroxybenzyl)propionohydrazide;hydrochloride 2-azanyl-3-oxidanyl-N'-[[2,3,4-tris(oxidanyl)phenyl]methyl]propanehydrazide;hydrochloride Benserazide SMR000058421 | cid_26964
Type:
Small organic molecule
Emp. Form.:
C10H15N3O5
Mol. Mass.:
257.2432
SMILES:
NC(CO)C(=O)NNCc1ccc(O)c(O)c1O
: