Target
Alkaline phosphatase, tissue-nonspecific isozyme
Ligand
BDBM39769
Substrate
Meas. Tech.
Dose Response confirmation of uHTS activators of Human Intestinal Alkaline Phosphatase using Tissue Nonspecific Alkaline Phosphatase.
EC50
69700±n/a nM
Citation
 PubChem, PC Dose Response confirmation of uHTS activators of Human Intestinal Alkaline Phosphatase using Tissue Nonspecific Alkaline Phosphatase. PubChem Bioassay (2010)[AID] 
Target
Name:
Alkaline phosphatase, tissue-nonspecific isozyme
Synonyms:
ALPL tissue-nonspecific alkaline phosphatase precursor
Type:
PROTEIN
Mol. Mass.:
57306.17
Organism:
Homo sapiens (Human)
Description:
ChEMBL_1448917
Residue:
524
  
Inhibitor
Name:
BDBM39769
Synonyms:
2-[1-(1H-benzimidazol-2-yl)-3-(3,5-dimethylphenyl)propan-2-yl]-1H-benzimidazole MLS000551054 cid_3094795
Type:
Small organic molecule
Emp. Form.:
C25H24N4
Mol. Mass.:
380.4849
SMILES:
Cc1cc(C)cc(CC(Cc2nc3ccccc3[nH]2)c2nc3ccccc3[nH]2)c1
: