Target
Alkaline phosphatase, tissue-nonspecific isozyme
Ligand
BDBM75626
Substrate
Meas. Tech.
Dose Response confirmation of uHTS activators of Human Intestinal Alkaline Phosphatase using Tissue Nonspecific Alkaline Phosphatase.
EC50
17700±n/a nM
Citation
 PubChem, PC Dose Response confirmation of uHTS activators of Human Intestinal Alkaline Phosphatase using Tissue Nonspecific Alkaline Phosphatase. PubChem Bioassay (2010)[AID] 
Target
Name:
Alkaline phosphatase, tissue-nonspecific isozyme
Synonyms:
ALPL tissue-nonspecific alkaline phosphatase precursor
Type:
PROTEIN
Mol. Mass.:
57306.17
Organism:
Homo sapiens (Human)
Description:
ChEMBL_1448917
Residue:
524
  
Inhibitor
Name:
BDBM75626
Synonyms:
MLS000582497 N-(3-ethoxypropyl)-4-oxidanylidene-4-[2-(2-phenyl-[1,2,4]triazolo[1,5-c]quinazolin-5-yl)hydrazinyl]butanamide N-(3-ethoxypropyl)-4-oxo-4-[2-(2-phenyl-[1,2,4]triazolo[1,5-c]quinazolin-5-yl)hydrazinyl]butanamide SMR000206483 | cid_12004913
Type:
Small organic molecule
Emp. Form.:
C24H27N7O3
Mol. Mass.:
461.5163
SMILES:
CCOCCCNC(=O)CCC(=O)NNc1nc2ccccc2c2nc(nn12)-c1ccccc1
: