Target
Alkaline phosphatase, tissue-nonspecific isozyme
Ligand
BDBM75635
Substrate
Meas. Tech.
Dose Response confirmation of uHTS activators of Human Intestinal Alkaline Phosphatase using Tissue Nonspecific Alkaline Phosphatase.
EC50
23300±n/a nM
Citation
 PubChem, PC Dose Response confirmation of uHTS activators of Human Intestinal Alkaline Phosphatase using Tissue Nonspecific Alkaline Phosphatase. PubChem Bioassay (2010)[AID] 
Target
Name:
Alkaline phosphatase, tissue-nonspecific isozyme
Synonyms:
ALPL tissue-nonspecific alkaline phosphatase precursor
Type:
PROTEIN
Mol. Mass.:
57306.17
Organism:
Homo sapiens (Human)
Description:
ChEMBL_1448917
Residue:
524
  
Inhibitor
Name:
BDBM75635
Synonyms:
2-[[2-(2-fluoroanilino)-2-keto-ethyl]-methyl-amino]-N-(2,3,4-trifluorophenyl)acetamide 2-[[2-[(2-fluorophenyl)amino]-2-oxidanylidene-ethyl]-methyl-amino]-N-[2,3,4-tris(fluoranyl)phenyl]ethanamide SMR000353000 | cid_2118581
Type:
Small organic molecule
Emp. Form.:
C17H15F4N3O2
Mol. Mass.:
369.3135
SMILES:
CN(CC(=O)Nc1ccccc1F)CC(=O)Nc1ccc(F)c(F)c1F
: