Target
Alkaline phosphatase, tissue-nonspecific isozyme
Ligand
BDBM75640
Substrate
Meas. Tech.
Dose Response confirmation of uHTS activators of Human Intestinal Alkaline Phosphatase using Tissue Nonspecific Alkaline Phosphatase.
EC50
34900±n/a nM
Citation
 PubChem, PC Dose Response confirmation of uHTS activators of Human Intestinal Alkaline Phosphatase using Tissue Nonspecific Alkaline Phosphatase. PubChem Bioassay (2010)[AID] 
Target
Name:
Alkaline phosphatase, tissue-nonspecific isozyme
Synonyms:
ALPL tissue-nonspecific alkaline phosphatase precursor
Type:
PROTEIN
Mol. Mass.:
57306.17
Organism:
Homo sapiens (Human)
Description:
ChEMBL_1448917
Residue:
524
  
Inhibitor
Name:
BDBM75640
Synonyms:
5-(1,1-Dimethyl-propyl)-4,5,6,7-tetrahydro-1H-indazole-3-carboxylic acid [1-furan-2-yl-eth-(E)-ylidene]-hydrazide MLS000769042 N-[1-(furan-2-yl)ethylideneamino]-5-(2-methylbutan-2-yl)-4,5,6,7-tetrahydro-1H-indazole-3-carboxamide cid_3751730
Type:
Small organic molecule
Emp. Form.:
C19H26N4O2
Mol. Mass.:
342.4353
SMILES:
CCC(C)(C)C1CCc2n[nH]c(C(=O)NN=C(C)c3ccco3)c2C1
: