Target
Alkaline phosphatase, tissue-nonspecific isozyme
Ligand
BDBM75656
Substrate
Meas. Tech.
Dose Response confirmation of uHTS activators of Human Intestinal Alkaline Phosphatase using Tissue Nonspecific Alkaline Phosphatase.
EC50
>100000±n/a nM
Citation
 PubChem, PC Dose Response confirmation of uHTS activators of Human Intestinal Alkaline Phosphatase using Tissue Nonspecific Alkaline Phosphatase. PubChem Bioassay (2010)[AID] 
Target
Name:
Alkaline phosphatase, tissue-nonspecific isozyme
Synonyms:
ALPL tissue-nonspecific alkaline phosphatase precursor
Type:
PROTEIN
Mol. Mass.:
57306.17
Organism:
Homo sapiens (Human)
Description:
ChEMBL_1448917
Residue:
524
  
Inhibitor
Name:
BDBM75656
Synonyms:
(3Z)-5-(hydroxyamino)-6-nitroso-3-phenacylidene-1,4-dihydropyrazin-2-one MLS001164264 cid_5904198
Type:
Small organic molecule
Emp. Form.:
C12H10N4O4
Mol. Mass.:
274.2322
SMILES:
ONc1nc(CC(=O)c2ccccc2)c(=O)[nH]c1N=O
: