Target
Alkaline phosphatase, tissue-nonspecific isozyme
Ligand
BDBM75674
Substrate
Meas. Tech.
Dose Response confirmation of uHTS activators of Human Intestinal Alkaline Phosphatase using Tissue Nonspecific Alkaline Phosphatase.
EC50
19100±n/a nM
Citation
 PubChem, PC Dose Response confirmation of uHTS activators of Human Intestinal Alkaline Phosphatase using Tissue Nonspecific Alkaline Phosphatase. PubChem Bioassay (2010)[AID] 
Target
Name:
Alkaline phosphatase, tissue-nonspecific isozyme
Synonyms:
ALPL tissue-nonspecific alkaline phosphatase precursor
Type:
PROTEIN
Mol. Mass.:
57306.17
Organism:
Homo sapiens (Human)
Description:
ChEMBL_1448917
Residue:
524
  
Inhibitor
Name:
BDBM75674
Synonyms:
4-methyl-N-[3-(methylthio)-1-[[(2-morpholinothiazole-4-carbonyl)amino]carbamoyl]propyl]benzenesulfonamide 4-methyl-N-[4-methylsulfanyl-1-[2-(2-morpholin-4-yl-1,3-thiazole-4-carbonyl)hydrazinyl]-1-oxobutan-2-yl]benzenesulfonamide MLS001031833 cid_24816546
Type:
Small organic molecule
Emp. Form.:
C20H27N5O5S3
Mol. Mass.:
513.654
SMILES:
CSCCC(NS(=O)(=O)c1ccc(C)cc1)C(=O)NNC(=O)c1csc(n1)N1CCOCC1
: