Target
Alkaline phosphatase, tissue-nonspecific isozyme
Ligand
BDBM75686
Substrate
Meas. Tech.
Dose Response confirmation of uHTS activators of Human Intestinal Alkaline Phosphatase using Tissue Nonspecific Alkaline Phosphatase.
EC50
66100±n/a nM
Citation
 PubChem, PC Dose Response confirmation of uHTS activators of Human Intestinal Alkaline Phosphatase using Tissue Nonspecific Alkaline Phosphatase. PubChem Bioassay (2010)[AID] 
Target
Name:
Alkaline phosphatase, tissue-nonspecific isozyme
Synonyms:
ALPL tissue-nonspecific alkaline phosphatase precursor
Type:
PROTEIN
Mol. Mass.:
57306.17
Organism:
Homo sapiens (Human)
Description:
ChEMBL_1448917
Residue:
524
  
Inhibitor
Name:
BDBM75686
Synonyms:
MLS001072358 N-[2-[1-[(4-fluoranyl-3-methoxy-phenyl)methyl]piperidin-4-yl]pyrazol-3-yl]-4-phenyl-butanamide N-[2-[1-[(4-fluoro-3-methoxyphenyl)methyl]piperidin-4-yl]pyrazol-3-yl]-4-phenylbutanamide cid_24819455
Type:
Small organic molecule
Emp. Form.:
C26H31FN4O2
Mol. Mass.:
450.5483
SMILES:
COc1cc(CN2CCC(CC2)n2nccc2NC(=O)CCCc2ccccc2)ccc1F
: