Target
Alkaline phosphatase, germ cell type
Ligand
BDBM59281
Substrate
Meas. Tech.
Dose Response confirmation of uHTS activators of Human Intestinal Alkaline Phosphatase using Placental Alkaline Phosphatase
EC50
9820±n/a nM
Citation
 PubChem, PC Dose Response confirmation of uHTS activators of Human Intestinal Alkaline Phosphatase using Placental Alkaline Phosphatase PubChem Bioassay (2010)[AID] 
Target
Name:
Alkaline phosphatase, germ cell type
Synonyms:
ALPG ALPPL2 PPBN_HUMAN | placental-like alkaline phosphatase preproprotein
Type:
PROTEIN
Mol. Mass.:
57374.31
Organism:
Homo sapiens (Human)
Description:
ChEMBL_29964
Residue:
532
  
Inhibitor
Name:
BDBM59281
Synonyms:
2-(2-methylpropanoylcarbamothioylamino)-N-phenyl-benzamide 2-(isobutyrylthiocarbamoylamino)-N-phenyl-benzamide 2-{[(isobutyrylamino)carbothioyl]amino}-N-phenylbenzamide SMR000160679 | cid_1792447
Type:
Small organic molecule
Emp. Form.:
C18H19N3O2S
Mol. Mass.:
341.427
SMILES:
CC(C)C(=O)NC(=S)Nc1ccccc1C(=O)Nc1ccccc1
: