Target
Alkaline phosphatase, germ cell type
Ligand
BDBM75635
Substrate
Meas. Tech.
Dose Response confirmation of uHTS activators of Human Intestinal Alkaline Phosphatase using Placental Alkaline Phosphatase
EC50
28400±n/a nM
Citation
 PubChem, PC Dose Response confirmation of uHTS activators of Human Intestinal Alkaline Phosphatase using Placental Alkaline Phosphatase PubChem Bioassay (2010)[AID] 
Target
Name:
Alkaline phosphatase, germ cell type
Synonyms:
ALPG ALPPL2 PPBN_HUMAN | placental-like alkaline phosphatase preproprotein
Type:
PROTEIN
Mol. Mass.:
57374.31
Organism:
Homo sapiens (Human)
Description:
ChEMBL_29964
Residue:
532
  
Inhibitor
Name:
BDBM75635
Synonyms:
2-[[2-(2-fluoroanilino)-2-keto-ethyl]-methyl-amino]-N-(2,3,4-trifluorophenyl)acetamide 2-[[2-[(2-fluorophenyl)amino]-2-oxidanylidene-ethyl]-methyl-amino]-N-[2,3,4-tris(fluoranyl)phenyl]ethanamide SMR000353000 | cid_2118581
Type:
Small organic molecule
Emp. Form.:
C17H15F4N3O2
Mol. Mass.:
369.3135
SMILES:
CN(CC(=O)Nc1ccccc1F)CC(=O)Nc1ccc(F)c(F)c1F
: