Target
Alkaline phosphatase, germ cell type
Ligand
BDBM43816
Substrate
Meas. Tech.
Dose Response confirmation of uHTS activators of Human Intestinal Alkaline Phosphatase using Placental Alkaline Phosphatase
EC50
550±n/a nM
Citation
 PubChem, PC Dose Response confirmation of uHTS activators of Human Intestinal Alkaline Phosphatase using Placental Alkaline Phosphatase PubChem Bioassay (2010)[AID] 
Target
Name:
Alkaline phosphatase, germ cell type
Synonyms:
ALPG ALPPL2 PPBN_HUMAN | placental-like alkaline phosphatase preproprotein
Type:
PROTEIN
Mol. Mass.:
57374.31
Organism:
Homo sapiens (Human)
Description:
ChEMBL_29964
Residue:
532
  
Inhibitor
Name:
BDBM43816
Synonyms:
5'-bromanylspiro[1,2-dihydro-4,1,2-benzoxadiazine-3,3'-1H-indole]-2'-one 5'-bromospiro[1,2-dihydro-4,1,2-benzoxadiazine-3,3'-1H-indole]-2'-one MLS-0258268.0001 | cid_4879298
Type:
Small organic molecule
Emp. Form.:
C14H10BrN3O2
Mol. Mass.:
332.152
SMILES:
Brc1ccc2NC(=O)C3(NNc4ccccc4O3)c2c1
: