Target
Alkaline phosphatase, germ cell type
Ligand
BDBM75647
Substrate
Meas. Tech.
Dose Response confirmation of uHTS activators of Human Intestinal Alkaline Phosphatase using Placental Alkaline Phosphatase
EC50
24100±n/a nM
Citation
 PubChem, PC Dose Response confirmation of uHTS activators of Human Intestinal Alkaline Phosphatase using Placental Alkaline Phosphatase PubChem Bioassay (2010)[AID] 
Target
Name:
Alkaline phosphatase, germ cell type
Synonyms:
ALPG ALPPL2 PPBN_HUMAN | placental-like alkaline phosphatase preproprotein
Type:
PROTEIN
Mol. Mass.:
57374.31
Organism:
Homo sapiens (Human)
Description:
ChEMBL_29964
Residue:
532
  
Inhibitor
Name:
BDBM75647
Synonyms:
4-isopropoxy-N-(1H-1,2,4-triazol-5-yl)benzamide 4-propan-2-yloxy-N-(1H-1,2,4-triazol-5-yl)benzamide SMR000499417 | cid_6472712
Type:
Small organic molecule
Emp. Form.:
C12H14N4O2
Mol. Mass.:
246.2652
SMILES:
CC(C)Oc1ccc(cc1)C(=O)Nc1nnc[nH]1
: