Target
Alkaline phosphatase, germ cell type
Ligand
BDBM75655
Substrate
Meas. Tech.
Dose Response confirmation of uHTS activators of Human Intestinal Alkaline Phosphatase using Placental Alkaline Phosphatase
EC50
78900±n/a nM
Citation
 PubChem, PC Dose Response confirmation of uHTS activators of Human Intestinal Alkaline Phosphatase using Placental Alkaline Phosphatase PubChem Bioassay (2010)[AID] 
Target
Name:
Alkaline phosphatase, germ cell type
Synonyms:
ALPG ALPPL2 PPBN_HUMAN | placental-like alkaline phosphatase preproprotein
Type:
PROTEIN
Mol. Mass.:
57374.31
Organism:
Homo sapiens (Human)
Description:
ChEMBL_29964
Residue:
532
  
Inhibitor
Name:
BDBM75655
Synonyms:
1-[[1-(2-methylbenzyl)-4-piperidyl]methyl]-3-(3,4,5-trimethoxyphenyl)urea 1-[[1-[(2-methylphenyl)methyl]piperidin-4-yl]methyl]-3-(3,4,5-trimethoxyphenyl)urea N-{[1-(2-methylbenzyl)piperidin-4-yl]methyl}-N'-(3,4,5-trimethoxyphenyl)urea cid_23609225
Type:
Small organic molecule
Emp. Form.:
C24H33N3O4
Mol. Mass.:
427.5365
SMILES:
COc1cc(NC(=O)NCC2CCN(Cc3ccccc3C)CC2)cc(OC)c1OC
: