Target
Alkaline phosphatase, germ cell type
Ligand
BDBM66779
Substrate
Meas. Tech.
Dose Response confirmation of uHTS activators of Human Intestinal Alkaline Phosphatase using Placental Alkaline Phosphatase
EC50
23100±n/a nM
Citation
 PubChem, PC Dose Response confirmation of uHTS activators of Human Intestinal Alkaline Phosphatase using Placental Alkaline Phosphatase PubChem Bioassay (2010)[AID] 
Target
Name:
Alkaline phosphatase, germ cell type
Synonyms:
ALPG ALPPL2 PPBN_HUMAN | placental-like alkaline phosphatase preproprotein
Type:
PROTEIN
Mol. Mass.:
57374.31
Organism:
Homo sapiens (Human)
Description:
ChEMBL_29964
Residue:
532
  
Inhibitor
Name:
BDBM66779
Synonyms:
(5E)-N-(2,5-dimethoxyphenyl)-5-(3-methyl-6-oxidanylidene-cyclohexa-2,4-dien-1-ylidene)-1,2-dihydropyrazole-3-carboxamide (5E)-N-(2,5-dimethoxyphenyl)-5-(3-methyl-6-oxocyclohexa-2,4-dien-1-ylidene)-1,2-dihydropyrazole-3-carboxamide MLS001214467 cid_6100116
Type:
Small organic molecule
Emp. Form.:
C19H19N3O4
Mol. Mass.:
353.3719
SMILES:
COc1ccc(OC)c(NC(=O)c2cc(n[nH]2)-c2cc(C)ccc2O)c1
: