Target
Alkaline phosphatase, germ cell type
Ligand
BDBM65665
Substrate
Meas. Tech.
Dose Response confirmation of uHTS activators of Human Intestinal Alkaline Phosphatase using Placental Alkaline Phosphatase
EC50
16400±n/a nM
Citation
 PubChem, PC Dose Response confirmation of uHTS activators of Human Intestinal Alkaline Phosphatase using Placental Alkaline Phosphatase PubChem Bioassay (2010)[AID] 
Target
Name:
Alkaline phosphatase, germ cell type
Synonyms:
ALPG ALPPL2 PPBN_HUMAN | placental-like alkaline phosphatase preproprotein
Type:
PROTEIN
Mol. Mass.:
57374.31
Organism:
Homo sapiens (Human)
Description:
ChEMBL_29964
Residue:
532
  
Inhibitor
Name:
BDBM65665
Synonyms:
1-[(2-bromobenzoyl)amino]-3-cyclohexyl-thiourea 1-[(2-bromophenyl)carbonylamino]-3-cyclohexyl-thiourea MLS001075515 cid_1929796
Type:
Small organic molecule
Emp. Form.:
C14H18BrN3OS
Mol. Mass.:
356.281
SMILES:
Brc1ccccc1C(=O)NNC(=S)NC1CCCCC1
: