Target
Alkaline phosphatase, germ cell type
Ligand
BDBM75682
Substrate
Meas. Tech.
Dose Response confirmation of uHTS activators of Human Intestinal Alkaline Phosphatase using Placental Alkaline Phosphatase
EC50
66800±n/a nM
Citation
 PubChem, PC Dose Response confirmation of uHTS activators of Human Intestinal Alkaline Phosphatase using Placental Alkaline Phosphatase PubChem Bioassay (2010)[AID] 
Target
Name:
Alkaline phosphatase, germ cell type
Synonyms:
ALPG ALPPL2 PPBN_HUMAN | placental-like alkaline phosphatase preproprotein
Type:
PROTEIN
Mol. Mass.:
57374.31
Organism:
Homo sapiens (Human)
Description:
ChEMBL_29964
Residue:
532
  
Inhibitor
Name:
BDBM75682
Synonyms:
MLS001146570 N-[(2-chloro-6-fluoro-benzylidene)amino]-5-cyclopropyl-1H-pyrazole-3-carboxamide SMR000646655 | cid_946072
Type:
Small organic molecule
Emp. Form.:
C14H12ClFN4O
Mol. Mass.:
306.723
SMILES:
Fc1cccc(Cl)c1C=NNC(=O)c1cc(n[nH]1)C1CC1
: