Target
Alkaline phosphatase, germ cell type
Ligand
BDBM75697
Substrate
Meas. Tech.
Dose Response confirmation of uHTS activators of Human Intestinal Alkaline Phosphatase using Placental Alkaline Phosphatase
EC50
16700±n/a nM
Citation
 PubChem, PC Dose Response confirmation of uHTS activators of Human Intestinal Alkaline Phosphatase using Placental Alkaline Phosphatase PubChem Bioassay (2010)[AID] 
Target
Name:
Alkaline phosphatase, germ cell type
Synonyms:
ALPG ALPPL2 PPBN_HUMAN | placental-like alkaline phosphatase preproprotein
Type:
PROTEIN
Mol. Mass.:
57374.31
Organism:
Homo sapiens (Human)
Description:
ChEMBL_29964
Residue:
532
  
Inhibitor
Name:
BDBM75697
Synonyms:
MLS002163808 N-[3-[2-[2-(4-bromophenoxy)acetyl]hydrazinyl]-3-oxopropyl]-3,4-dimethylbenzenesulfonamide N-[3-[[2-(4-bromophenoxy)-1-oxoethyl]hydrazo]-3-oxopropyl]-3,4-dimethylbenzenesulfonamide cid_2542414
Type:
Small organic molecule
Emp. Form.:
C19H22BrN3O5S
Mol. Mass.:
484.364
SMILES:
Cc1ccc(cc1C)S(=O)(=O)NCCC(=O)NNC(=O)COc1ccc(Br)cc1
: