Target
Alkaline phosphatase, germ cell type
Ligand
BDBM75701
Substrate
Meas. Tech.
Dose Response confirmation of uHTS activators of Human Intestinal Alkaline Phosphatase using Placental Alkaline Phosphatase
EC50
42300±n/a nM
Citation
 PubChem, PC Dose Response confirmation of uHTS activators of Human Intestinal Alkaline Phosphatase using Placental Alkaline Phosphatase PubChem Bioassay (2010)[AID] 
Target
Name:
Alkaline phosphatase, germ cell type
Synonyms:
ALPG ALPPL2 PPBN_HUMAN | placental-like alkaline phosphatase preproprotein
Type:
PROTEIN
Mol. Mass.:
57374.31
Organism:
Homo sapiens (Human)
Description:
ChEMBL_29964
Residue:
532
  
Inhibitor
Name:
BDBM75701
Synonyms:
3-[[(2-hydroxybenzoyl)amino]carbamoyl]-N-(3-methylphenyl)benzenesulfonamide 3-[[[(2-hydroxyphenyl)-oxomethyl]hydrazo]-oxomethyl]-N-(3-methylphenyl)benzenesulfonamide N-(m-tolyl)-3-[(salicyloylamino)carbamoyl]benzenesulfonamide cid_25163558
Type:
Small organic molecule
Emp. Form.:
C21H19N3O5S
Mol. Mass.:
425.458
SMILES:
Cc1cccc(NS(=O)(=O)c2cccc(c2)C(=O)NNC(=O)c2ccccc2O)c1
: