Target
Alkaline phosphatase, germ cell type
Ligand
BDBM39724
Substrate
Meas. Tech.
Dose Response confirmation of uHTS inhibitors of Human Intestinal Alkaline Phosphatase using Placental Alkaline Phosphatase
IC50
30300±n/a nM
Citation
 PubChem, PC Dose Response confirmation of uHTS inhibitors of Human Intestinal Alkaline Phosphatase using Placental Alkaline Phosphatase PubChem Bioassay (2010)[AID] 
Target
Name:
Alkaline phosphatase, germ cell type
Synonyms:
ALPG ALPPL2 PPBN_HUMAN | placental-like alkaline phosphatase preproprotein
Type:
PROTEIN
Mol. Mass.:
57374.31
Organism:
Homo sapiens (Human)
Description:
ChEMBL_29964
Residue:
532
  
Inhibitor
Name:
BDBM39724
Synonyms:
4-(2-benzylsulfanylethyl)pyridine;phosphoric acid 4-[2-(benzylthio)ethyl]pyridine;phosphoric acid 4-[2-(phenylmethylthio)ethyl]pyridine;phosphoric acid SMR000137553 | cid_2827182
Type:
Small organic molecule
Emp. Form.:
C14H15NS
Mol. Mass.:
229.341
SMILES:
C(Cc1ccncc1)SCc1ccccc1
: