Target
Alkaline phosphatase, germ cell type
Ligand
BDBM75758
Substrate
Meas. Tech.
Dose Response confirmation of uHTS inhibitors of Human Intestinal Alkaline Phosphatase using Placental Alkaline Phosphatase
IC50
>100000±n/a nM
Citation
 PubChem, PC Dose Response confirmation of uHTS inhibitors of Human Intestinal Alkaline Phosphatase using Placental Alkaline Phosphatase PubChem Bioassay (2010)[AID] 
Target
Name:
Alkaline phosphatase, germ cell type
Synonyms:
ALPG ALPPL2 PPBN_HUMAN | placental-like alkaline phosphatase preproprotein
Type:
PROTEIN
Mol. Mass.:
57374.31
Organism:
Homo sapiens (Human)
Description:
ChEMBL_29964
Residue:
532
  
Inhibitor
Name:
BDBM75758
Synonyms:
(1Z)-1-(4-nitrophenyl)ethanone (2-nitrophenyl)hydrazone 2-nitro-N-[1-(4-nitrophenyl)ethylideneamino]aniline SMR000554568 | cid_3742591
Type:
Small organic molecule
Emp. Form.:
C14H12N4O4
Mol. Mass.:
300.2695
SMILES:
CC(N=Nc1ccccc1[N+]([O-])=O)c1ccc(cc1)[N+]([O-])=O
: