Target
Alkaline phosphatase, germ cell type
Ligand
BDBM75759
Substrate
Meas. Tech.
Dose Response confirmation of uHTS inhibitors of Human Intestinal Alkaline Phosphatase using Placental Alkaline Phosphatase
IC50
35100±n/a nM
Citation
 PubChem, PC Dose Response confirmation of uHTS inhibitors of Human Intestinal Alkaline Phosphatase using Placental Alkaline Phosphatase PubChem Bioassay (2010)[AID] 
Target
Name:
Alkaline phosphatase, germ cell type
Synonyms:
ALPG ALPPL2 PPBN_HUMAN | placental-like alkaline phosphatase preproprotein
Type:
PROTEIN
Mol. Mass.:
57374.31
Organism:
Homo sapiens (Human)
Description:
ChEMBL_29964
Residue:
532
  
Inhibitor
Name:
BDBM75759
Synonyms:
(4E)-4-(3-bromo-5-ethoxy-4-hydroxybenzylidene)-3-methylisoxazol-5(4H)-one 4-[(Z)-(3-bromo-5-ethoxy-4-keto-cyclohexa-2,5-dien-1-ylidene)methyl]-3-methyl-3-isoxazolin-5-one 4-[(Z)-(3-bromo-5-ethoxy-4-oxocyclohexa-2,5-dien-1-ylidene)methyl]-3-methyl-2H-1,2-oxazol-5-one SMR000558422 | cid_6537416
Type:
Small organic molecule
Emp. Form.:
C13H12BrNO4
Mol. Mass.:
326.143
SMILES:
CCOC1=CC(=Cc2c(C)[nH]oc2=O)C=C(Br)C1=O
: