Target
Caspase-3
Ligand
BDBM76461
Substrate
Meas. Tech.
Dose Response confirmation of inhibitors of Sentrin-specific proteases (SENPs) using a Caspase-3 Selectivity assay
IC50
3440±n/a nM
Citation
 PubChem, PC Dose Response confirmation of inhibitors of Sentrin-specific proteases (SENPs) using a Caspase-3 Selectivity assay PubChem Bioassay (2010)[AID] 
Target
Name:
Caspase-3
Synonyms:
Apopain CASP3 CPP-32 Caspase 3 Caspase-3 subunit p17 SCA-1 Yama protein | caspase-3 preproprotein
Type:
Hydrolase; heterotetramer of two heterodimers
Mol. Mass.:
31607.55
Organism:
Homo sapiens (Human)
Description:
Residue:
277
  
Inhibitor
Name:
BDBM76461
Synonyms:
(2Z)-2-(2-thenylidene)benzothiophen-3-one 2-Thiophen-2-ylmethylene-benzo[b]thiophen-3-one SMR000176244 | cid_1823283
Type:
Small organic molecule
Emp. Form.:
C13H8OS2
Mol. Mass.:
244.332
SMILES:
O=C1\C(Sc2ccccc12)=C\c1cccs1
: