Target
Caspase-3
Ligand
BDBM33185
Substrate
Meas. Tech.
Dose Response confirmation of inhibitors of Sentrin-specific proteases (SENPs) using a Caspase-3 Selectivity assay
IC50
4500±n/a nM
Citation
 PubChem, PC Dose Response confirmation of inhibitors of Sentrin-specific proteases (SENPs) using a Caspase-3 Selectivity assay PubChem Bioassay (2010)[AID] 
Target
Name:
Caspase-3
Synonyms:
Apopain CASP3 CPP-32 Caspase 3 Caspase-3 subunit p17 SCA-1 Yama protein | caspase-3 preproprotein
Type:
Hydrolase; heterotetramer of two heterodimers
Mol. Mass.:
31607.55
Organism:
Homo sapiens (Human)
Description:
Residue:
277
  
Inhibitor
Name:
BDBM33185
Synonyms:
4-({(4Z)-1-oxo-4-[(phenylsulfonyl)imino]-1,4-dihydronaphthalen-2-yl}amino)benzoic acid 4-[[(4Z)-4-besylimino-1-keto-2-naphthyl]amino]benzoic acid 4-[[4-(benzenesulfonylimino)-1-oxo-2-naphthalenyl]amino]benzoic acid MLS000686314 cid_4053104
Type:
Small organic molecule
Emp. Form.:
C23H16N2O5S
Mol. Mass.:
432.449
SMILES:
OC(=O)c1ccc(NC2=CC(=NS(=O)(=O)c3ccccc3)c3ccccc3C2=O)cc1
: