Target
Caspase-3
Ligand
BDBM46528
Substrate
Meas. Tech.
Dose Response confirmation of inhibitors of Sentrin-specific proteases (SENPs) using a Caspase-3 Selectivity assay
IC50
3930±n/a nM
Citation
 PubChem, PC Dose Response confirmation of inhibitors of Sentrin-specific proteases (SENPs) using a Caspase-3 Selectivity assay PubChem Bioassay (2010)[AID] 
Target
Name:
Caspase-3
Synonyms:
Apopain CASP3 CPP-32 Caspase 3 Caspase-3 subunit p17 SCA-1 Yama protein | caspase-3 preproprotein
Type:
Hydrolase; heterotetramer of two heterodimers
Mol. Mass.:
31607.55
Organism:
Homo sapiens (Human)
Description:
Residue:
277
  
Inhibitor
Name:
BDBM46528
Synonyms:
4-amino-N'-[(4-nitrobenzylidene)amino]furazan-3-carboxamidine 4-azanyl-N'-[(4-nitrophenyl)methylideneamino]-1,2,5-oxadiazole-3-carboximidamide SMR000427774 | cid_2841377
Type:
Small organic molecule
Emp. Form.:
C10H9N7O3
Mol. Mass.:
275.2236
SMILES:
NC(=N[N-][CH+]c1ccc(cc1)[N+]([O-])=O)c1nonc1N
: