Target
Caspase-3
Ligand
BDBM50091987
Substrate
Meas. Tech.
Dose Response confirmation of inhibitors of Sentrin-specific proteases (SENPs) using a Caspase-3 Selectivity assay
IC50
20700±n/a nM
Citation
 PubChem, PC Dose Response confirmation of inhibitors of Sentrin-specific proteases (SENPs) using a Caspase-3 Selectivity assay PubChem Bioassay (2010)[AID] 
Target
Name:
Caspase-3
Synonyms:
Apopain CASP3 CPP-32 Caspase 3 Caspase-3 subunit p17 SCA-1 Yama protein | caspase-3 preproprotein
Type:
Hydrolase; heterotetramer of two heterodimers
Mol. Mass.:
31607.55
Organism:
Homo sapiens (Human)
Description:
Residue:
277
  
Inhibitor
Name:
BDBM50091987
Synonyms:
3-Hydroxy-naphthalene-2-carboxylic acid (4-methoxy-phenyl)-amide cid_66721
Type:
Small organic molecule
Emp. Form.:
C18H15NO3
Mol. Mass.:
293.3166
SMILES:
COc1ccc(NC(=O)c2cc3ccccc3cc2O)cc1
: