Target
Sentrin-specific protease 8
Ligand
BDBM34581
Substrate
Meas. Tech.
Dose Response confirmation of uHTS for inhibitors of Sentrin-specific protease 8 (SENP8) using a Luminescent assay
IC50
2060±n/a nM
Citation
 PubChem, PC Dose Response confirmation of uHTS for inhibitors of Sentrin-specific protease 8 (SENP8) using a Luminescent assay PubChem Bioassay (2010)[AID] 
Target
Name:
Sentrin-specific protease 8
Synonyms:
DEN1 PRSC2 SENP8_HUMAN | SUMO/sentrin specific peptidase family member 8
Type:
Enzyme Catalytic Domain
Mol. Mass.:
24104.52
Organism:
Homo sapiens (Human)
Description:
gi_262118306
Residue:
212
  
Inhibitor
Name:
BDBM34581
Synonyms:
2-amino-1-(3-methoxypropyl)-N-sec-butyl-pyrrolo[3,2-b]quinoxaline-3-carboxamide 2-amino-N-butan-2-yl-1-(3-methoxypropyl)pyrrolo[3,2-b]quinoxaline-3-carboxamide MLS000040978 cid_662388
Type:
Small organic molecule
Emp. Form.:
C19H25N5O2
Mol. Mass.:
355.4341
SMILES:
CCC(C)NC(=O)c1c(N)n(CCCOC)c2nc3ccccc3nc12
: