Target
Sentrin-specific protease 8
Ligand
BDBM76534
Substrate
Meas. Tech.
Dose Response confirmation of uHTS for inhibitors of Sentrin-specific protease 8 (SENP8) using a Luminescent assay
IC50
2640±n/a nM
Citation
 PubChem, PC Dose Response confirmation of uHTS for inhibitors of Sentrin-specific protease 8 (SENP8) using a Luminescent assay PubChem Bioassay (2010)[AID] 
Target
Name:
Sentrin-specific protease 8
Synonyms:
DEN1 PRSC2 SENP8_HUMAN | SUMO/sentrin specific peptidase family member 8
Type:
Enzyme Catalytic Domain
Mol. Mass.:
24104.52
Organism:
Homo sapiens (Human)
Description:
gi_262118306
Residue:
212
  
Inhibitor
Name:
BDBM76534
Synonyms:
2-[(Z)-2-(2-methylphenyl)ethenyl]-1H-quinazolin-4-one MLS000716114 cid_7325068
Type:
Small organic molecule
Emp. Form.:
C17H14N2O
Mol. Mass.:
262.3059
SMILES:
Cc1ccccc1C=Cc1nc2ccccc2c(=O)[nH]1
: