Target
Alkaline phosphatase, tissue-nonspecific isozyme
Ligand
BDBM76185
Substrate
Meas. Tech.
Dose Response confirmation of uHTS inhibitors of Mouse Intestinal Alkaline Phosphatase using Tissue Nonspecific Alkaline Phosphatase.
IC50
63300±n/a nM
Citation
 PubChem, PC Dose Response confirmation of uHTS inhibitors of Mouse Intestinal Alkaline Phosphatase using Tissue Nonspecific Alkaline Phosphatase. PubChem Bioassay (2010)[AID] 
Target
Name:
Alkaline phosphatase, tissue-nonspecific isozyme
Synonyms:
ALPL tissue-nonspecific alkaline phosphatase precursor
Type:
PROTEIN
Mol. Mass.:
57306.17
Organism:
Homo sapiens (Human)
Description:
ChEMBL_1448917
Residue:
524
  
Inhibitor
Name:
BDBM76185
Synonyms:
1-(3-fluorophenyl)-3-[9-(4-methylbenzyl)-9-azabicyclo[3.3.1]nonan-3-yl]urea MLS000709814 cid_3218129
Type:
Small organic molecule
Emp. Form.:
C23H28FN3O
Mol. Mass.:
381.4863
SMILES:
[H]C12CCCC([H])(CC(C1)NC(=O)Nc1cccc(F)c1)N2Cc1ccc(C)cc1
: