Target
Alkaline phosphatase, tissue-nonspecific isozyme
Ligand
BDBM76199
Substrate
Meas. Tech.
Dose Response confirmation of uHTS inhibitors of Mouse Intestinal Alkaline Phosphatase using Tissue Nonspecific Alkaline Phosphatase.
IC50
77100±n/a nM
Citation
 PubChem, PC Dose Response confirmation of uHTS inhibitors of Mouse Intestinal Alkaline Phosphatase using Tissue Nonspecific Alkaline Phosphatase. PubChem Bioassay (2010)[AID] 
Target
Name:
Alkaline phosphatase, tissue-nonspecific isozyme
Synonyms:
ALPL tissue-nonspecific alkaline phosphatase precursor
Type:
PROTEIN
Mol. Mass.:
57306.17
Organism:
Homo sapiens (Human)
Description:
ChEMBL_1448917
Residue:
524
  
Inhibitor
Name:
BDBM76199
Synonyms:
5-(2,4-dimethoxyphenyl)-2-(2-hydroxy-3-nitro-benzylidene)-3-keto-7-methyl-5H-thiazolo[3,2-a]pyrimidine-6-carboxylic acid ethyl ester MLS001179079 cid_4989907 ethyl 5-(2,4-dimethoxyphenyl)-2-{2-hydroxy-3-nitrobenzylidene}-7-methyl-3-oxo-2,3-dihydro-5H-[1,3]thiazolo[3,2-a]pyrimidine-6-carboxylate | ethyl 5-(2,4-dimethoxyphenyl)-7-methyl-2-[(3-nitro-2-oxidanyl-phenyl)methylidene]-3-oxidanylidene-5H-[1,3]thiazolo[3,2-a]pyrimidine-6-carboxylate
Type:
Small organic molecule
Emp. Form.:
C25H23N3O8S
Mol. Mass.:
525.53
SMILES:
CCOC(=O)C1=C(C)N=c2s\c(=C/c3cccc(c3O)[N+]([O-])=O)c(=O)n2C1c1ccc(OC)cc1OC
: