Target
Alkaline phosphatase, tissue-nonspecific isozyme
Ligand
BDBM71291
Substrate
Meas. Tech.
Dose Response confirmation of uHTS inhibitors of Mouse Intestinal Alkaline Phosphatase using Tissue Nonspecific Alkaline Phosphatase.
IC50
>100000±n/a nM
Citation
 PubChem, PC Dose Response confirmation of uHTS inhibitors of Mouse Intestinal Alkaline Phosphatase using Tissue Nonspecific Alkaline Phosphatase. PubChem Bioassay (2010)[AID] 
Target
Name:
Alkaline phosphatase, tissue-nonspecific isozyme
Synonyms:
ALPL tissue-nonspecific alkaline phosphatase precursor
Type:
PROTEIN
Mol. Mass.:
57306.17
Organism:
Homo sapiens (Human)
Description:
ChEMBL_1448917
Residue:
524
  
Inhibitor
Name:
BDBM71291
Synonyms:
(5E)-3-benzyl-5-(2,3-dihydroxybenzylidene)-2-thioxo-thiazolidin-4-one (5E)-5-[(2,3-dihydroxyphenyl)methylidene]-3-(phenylmethyl)-2-sulfanylidene-4-thiazolidinone 3-benzyl-5-(2,3-dihydroxybenzylidene)-2-thioxo-1,3-thiazolidin-4-one SMR000497264 | cid_2291671
Type:
Small organic molecule
Emp. Form.:
C17H13NO3S2
Mol. Mass.:
343.42
SMILES:
Oc1cccc(\C=C2\SC(=S)N(Cc3ccccc3)C2=O)c1O
: