Target
Alkaline phosphatase, tissue-nonspecific isozyme
Ligand
BDBM60881
Substrate
Meas. Tech.
Dose Response confirmation of uHTS inhibitors of Mouse Intestinal Alkaline Phosphatase using Tissue Nonspecific Alkaline Phosphatase.
IC50
>100000±n/a nM
Citation
 PubChem, PC Dose Response confirmation of uHTS inhibitors of Mouse Intestinal Alkaline Phosphatase using Tissue Nonspecific Alkaline Phosphatase. PubChem Bioassay (2010)[AID] 
Target
Name:
Alkaline phosphatase, tissue-nonspecific isozyme
Synonyms:
ALPL tissue-nonspecific alkaline phosphatase precursor
Type:
PROTEIN
Mol. Mass.:
57306.17
Organism:
Homo sapiens (Human)
Description:
ChEMBL_1448917
Residue:
524
  
Inhibitor
Name:
BDBM60881
Synonyms:
MLS001205093 N-[5-[2-[2-[(Z)-(3-hydroxy-4-oxocyclohexa-2,5-dien-1-ylidene)methyl]hydrazinyl]-2-oxoethyl]-1,3,4-thiadiazol-2-yl]benzamide N-[5-[2-[[(Z)-(3-hydroxy-4-oxo-1-cyclohexa-2,5-dienylidene)methyl]hydrazo]-2-oxoethyl]-1,3,4-thiadiazol-2-yl]benzamide SMR000513872 | cid_5720679
Type:
Small organic molecule
Emp. Form.:
C18H15N5O4S
Mol. Mass.:
397.408
SMILES:
Oc1ccc(C=NNC(=O)Cc2nnc(NC(=O)c3ccccc3)s2)cc1O
: