Target
Alkaline phosphatase, tissue-nonspecific isozyme
Ligand
BDBM76212
Substrate
Meas. Tech.
Dose Response confirmation of uHTS inhibitors of Mouse Intestinal Alkaline Phosphatase using Tissue Nonspecific Alkaline Phosphatase.
IC50
27500±n/a nM
Citation
 PubChem, PC Dose Response confirmation of uHTS inhibitors of Mouse Intestinal Alkaline Phosphatase using Tissue Nonspecific Alkaline Phosphatase. PubChem Bioassay (2010)[AID] 
Target
Name:
Alkaline phosphatase, tissue-nonspecific isozyme
Synonyms:
ALPL tissue-nonspecific alkaline phosphatase precursor
Type:
PROTEIN
Mol. Mass.:
57306.17
Organism:
Homo sapiens (Human)
Description:
ChEMBL_1448917
Residue:
524
  
Inhibitor
Name:
BDBM76212
Synonyms:
3-[(2-keto-3H-1,3-benzoxazol-6-yl)sulfonylamino]-N-o-anisyl-propionamide MLS001096065 N-[(2-methoxyphenyl)methyl]-3-[(2-oxo-3H-1,3-benzoxazol-6-yl)sulfonylamino]propanamide cid_24790972
Type:
Small organic molecule
Emp. Form.:
C18H19N3O6S
Mol. Mass.:
405.425
SMILES:
COc1ccccc1CNC(=O)CCNS(=O)(=O)c1ccc2[nH]c(=O)oc2c1
: