Target
Alkaline phosphatase, tissue-nonspecific isozyme
Ligand
BDBM76224
Substrate
Meas. Tech.
Dose Response confirmation of uHTS inhibitors of Mouse Intestinal Alkaline Phosphatase using Tissue Nonspecific Alkaline Phosphatase.
IC50
>100000±n/a nM
Citation
 PubChem, PC Dose Response confirmation of uHTS inhibitors of Mouse Intestinal Alkaline Phosphatase using Tissue Nonspecific Alkaline Phosphatase. PubChem Bioassay (2010)[AID] 
Target
Name:
Alkaline phosphatase, tissue-nonspecific isozyme
Synonyms:
ALPL tissue-nonspecific alkaline phosphatase precursor
Type:
PROTEIN
Mol. Mass.:
57306.17
Organism:
Homo sapiens (Human)
Description:
ChEMBL_1448917
Residue:
524
  
Inhibitor
Name:
BDBM76224
Synonyms:
MLS001147398 N-[[(4-hydroxybenzoyl)amino]thiocarbamoyl]thiophene-2-carboxamide N-[[[(4-hydroxyphenyl)-oxomethyl]hydrazo]-sulfanylidenemethyl]-2-thiophenecarboxamide SMR000673126 | cid_1818307
Type:
Small organic molecule
Emp. Form.:
C13H11N3O3S2
Mol. Mass.:
321.375
SMILES:
Oc1ccc(cc1)C(=O)NNC(=S)NC(=O)c1cccs1
: