Target
Alkaline phosphatase, tissue-nonspecific isozyme
Ligand
BDBM50331546
Substrate
Meas. Tech.
Dose Response confirmation of uHTS inhibitors of Mouse Intestinal Alkaline Phosphatase using Tissue Nonspecific Alkaline Phosphatase.
IC50
24100±n/a nM
Citation
 PubChem, PC Dose Response confirmation of uHTS inhibitors of Mouse Intestinal Alkaline Phosphatase using Tissue Nonspecific Alkaline Phosphatase. PubChem Bioassay (2010)[AID] 
Target
Name:
Alkaline phosphatase, tissue-nonspecific isozyme
Synonyms:
ALPL tissue-nonspecific alkaline phosphatase precursor
Type:
PROTEIN
Mol. Mass.:
57306.17
Organism:
Homo sapiens (Human)
Description:
ChEMBL_1448917
Residue:
524
  
Inhibitor
Name:
BDBM50331546
Synonyms:
2-(4,5,6-trihydroxy-3-oxo-3H-xanthen-9-yl)benzenesulfonic acid cid_360404 | pyrogallol red
Type:
Small organic molecule
Emp. Form.:
C19H12O8S
Mol. Mass.:
400.359
SMILES:
Oc1ccc2c(-c3ccccc3S(O)(=O)=O)c3ccc(=O)c(O)c3oc2c1O
: